Org.apache.spark.sparkexception job aborted due to stage failure.

Here is the full list of commands creating the list, writing it to HDFS and finally printing out the results on the console using hdfs: spark-shell. After the shell has started you type: val nums = sc.parallelize (List (1,2,3,4,5)) nums.saveAsTextFile ("/tmp/simple_list") :quit. Now we read the data from HDFS (Hadoop File System):

Org.apache.spark.sparkexception job aborted due to stage failure. Things To Know About Org.apache.spark.sparkexception job aborted due to stage failure.

Oct 6, 2016 · Teams. Q&A for work. Connect and share knowledge within a single location that is structured and easy to search. Learn more about Teams Caused by: org.apache.spark.SparkException: Job aborted due to stage failure: Total size of serialized results of 478 tasks (2026.0 MB) is bigger than spark.driver.maxResultSize (1024.0 MB) 当然可以通过调大spark.driver.maxResultSize的默认配置来解决问题,但如果不能从源头上解决小文件问题,以后还可能遇到 ...If absolutely necessary you can set the property spark.driver.maxResultSize to a value <X>g higher than the value reported in the exception message in the cluster Spark config ( AWS | Azure ): spark.driver.maxResultSize < X > g. The default value is 4g. For details, see Application Properties. If you set a high limit, out-of-memory errors can ...strange org.apache.spark.SparkException: Job aborted due to stage failure again. I'm trying to deploy spark application on standalone mode. In this application I'm training Naive Bayes classifier by using tf-idf vectors. I wrote application in similar manner to this post ( Spark MLLib TFIDF implementation for LogisticRegression ) The difference ...Teams. Q&A for work. Connect and share knowledge within a single location that is structured and easy to search. Learn more about Teams

Teams. Q&A for work. Connect and share knowledge within a single location that is structured and easy to search. Learn more about Teams

Exception in thread "main" org.apache.spark.SparkException : Job aborted due to stage failure: Task 3 in stage 0.0 failed 4 times, most recent failure: Lost task 3.3 in stage 0.0 (TID 14, 192.168.10.38): ExecutorLostFailure (executor 3 lost) Driver stacktrace:According to the content of README.md of GitHub repo Azure/azure-cosmosdb-spark as the figure below, you may should switch to use the latest jar file azure-cosmosdb-spark_2.4.0_2.11-1.4.0-uber.jar in it. And the maven repo for Azure CosmosDB Spark has released to 1.4.1 version, as the figure below.

Check the Availability of Free RAM - whether it matches the expectation of the job being executed. Run below on each of the servers in the cluster and check how much RAM & Space they have in offer. free -h. If you are using any HDFS files in the Spark job , make sure to Specify & Correctly use the HDFS URL.Teams. Q&A for work. Connect and share knowledge within a single location that is structured and easy to search. Learn more about Teams: org.apache.spark.SparkException: Job aborted due to stage failure: Task 9 in stage 47.0 failed 4 times, most recent failure: Lost task 9.3 in stage 47.0 (TID 2256, ip-172-31-00-00.eu-west-1.compute.internal, executor 10): org.apache.spark.sql.execution.QueryExecutionException: Parquet column cannot be converted in file s3a://bucket/prod ...不知道是什么原因。. (利用 Spark-submit 提交 参数都正常). 但是 集群上的版本是1.5,和2.0都无法跑出来结果,但是1.3就能出结果, 所以目前确定是 Spark 1.5以上的版本对协同过滤算法不兼容引起,具体原因不详。. task倾斜原因比较多,网络io,cpu,mem都有可能造成 ...

Caused by: org.apache.spark.SparkException: Job aborted due to stage failure: Aborting TaskSet 0.0 because task 0 (partition 0) cannot run anywhere due to node and executor blacklist.

Jan 4, 2019 · Exception in thread "main" org.apache.spark.SparkException: Job aborted due to stage failure: Task 0 in stage 2.0 failed 1 times, most recent failure: Lost task 0.0 in stage 2.0 (TID 119, localhost, executor driver): ExecutorLostFailure (executor driver exited caused by one of the running tasks) Reason: Executor heartbeat timed out after 128839 ...

Dec 6, 2018 · 1. "Accept timed out" generally points to a problem with your spark instance. It may be overloaded or not enough resources (memory/cpu) to start your job or it might be a temporary network issue. You can monitor you jobs on Spark UI. Also there is some issue with your code. You need to change this parameter in the cluster configuration. Go into the cluster settings, under Advanced select spark and paste spark.driver.maxResultSize 0 (for unlimited) or whatever the value suits you. Using 0 is not recommended. You should optimize the job by re partitioning.Teams. Q&A for work. Connect and share knowledge within a single location that is structured and easy to search. Learn more about TeamsIf I had a penny for every time I asked people "have you tried increasing the number of partitions to something quite large like at least 4 tasks per CPU - like even as high as 1000 partitions?"Exception in thread "main" org.apache.spark.SparkException: Job aborted due to stage failure: Task 0 in stage 2.0 failed 1 times, most recent failure: Lost task 0.0 in stage 2.0 (TID 119, localhost, executor driver): ExecutorLostFailure (executor driver exited caused by one of the running tasks) Reason: Executor heartbeat timed out after 128839 ...Solve : org.apache.spark.SparkException: Job aborted due to stage failure 1 Spark Error: Executor XXX finished with state EXITED message Command exited with code 1 exitStatus 1

Jan 4, 2019 · Exception in thread "main" org.apache.spark.SparkException: Job aborted due to stage failure: Task 0 in stage 2.0 failed 1 times, most recent failure: Lost task 0.0 in stage 2.0 (TID 119, localhost, executor driver): ExecutorLostFailure (executor driver exited caused by one of the running tasks) Reason: Executor heartbeat timed out after 128839 ... Problem Databricks throws an error when fitting a SparkML model or Pipeline: org.apache.spark.SparkException: Job aborted due to stage failure: Task 0 in sOct 6, 2016 · Teams. Q&A for work. Connect and share knowledge within a single location that is structured and easy to search. Learn more about Teams Viewed 8k times. 1. I am trying to do some computation using UDFs. But after the computation when i try to convert the pyspark dataframe to pandas it gives me org.apache.spark.SparkException: Exception thrown in awaitResult: I will put down the reproducible code. import pandas as pd import numpy as np import time n = 10000 sample_df = pd ...Here are some ideas to fix this error: Serializable the class. Declare the instance only within the lambda function passed in map. Make the NotSerializable object as a static and create it once per machine. Call rdd.forEachPartition and create the NotSerializable object in there like this: rdd.forEachPartition (iter -> { NotSerializable ...

Teams. Q&A for work. Connect and share knowledge within a single location that is structured and easy to search. Learn more about TeamsApr 8, 2019 · scala - org.apache.spark.SparkException: Job aborted due to stage failure: Task 98 in stage 11.0 failed 4 times - Stack Overflow org.apache.spark.SparkException: Job aborted due to stage failure: Task 98 in stage 11.0 failed 4 times Ask Question Asked 4 years, 4 months ago Modified 4 years, 4 months ago Viewed 46k times

May 16, 2022 · Problem Databricks throws an error when fitting a SparkML model or Pipeline: org.apache.spark.SparkException: Job aborted due to stage failure: Task 0 in s Hi Team, I am writing a Delta file in ADL-Gen2 from ADF for multiple files dynamically using Dataflows activity. For the initial run i am able to read the file from Azure DataBricks . But when i rerun the pipeline with truncate and load i am getting…org.apache.spark.SparkException: **Job aborted due to stage failure: Task 0 in stage 1.0 failed 1 times, most recent failure: Lost task 0.0 in stage 1.0 (TID 1 ...org.apache.spark.SparkException: Job aborted due to stage failure: Task 73 in stage 979.0 failed 1 times, most recent failure: Lost task 73.0 in stage 979.0 (TID 32624, localhost, executor driver): org.apache.spark.SparkException: Failed to execute user defined function($anonfun$4: (struct<other_double_VectorAssembler_a2059b1f0691:double ...Go into the cluster settings, under Advanced select spark and paste spark.driver.maxResultSize 0 (for unlimited) or whatever the value suits you. Using 0 is not recommended. You should optimize the job by re partitioning. For more details, refer "Spark Configurations - Application Properties". Hope this helps. Do let us know if you any further ...If issue persists, please contact Microsoft support for further assistance","Details":"org.apache.spark.SparkException: Job aborted due to stage failure: Task 320 in stage 21.0 failed 1 times, most recent failure: Lost task 320.0 in stage 21.0 (TID 1297, vm-42929650, executor 1): ExecutorLostFailure (executor 1 exited caused by one of the ...May 8, 2021 · org.apache.spark.SparkException: Job aborted due to stage failure: Task 3 in stage 6.0 failed 1 times, most recent failure: Lost task 3.0 in stage 6.0 (TID 62, LAPTOP-H7MM9952, executor driver): org.apache.spark.SparkException: Task failed while writing rows. In my project i am using spark-Cassandra-connector to read the from Cassandra table and process it further into JavaRDD but i am facing issue while processing Cassandra row to javaRDD.Job aborted due to stage failure: ShuffleMapStage 20 (repartition at data_prep.scala:87) has failed the maximum allowable number of times: 4 2 Why does Spark fail with FetchFailed error?

If I had a penny for every time I asked people "have you tried increasing the number of partitions to something quite large like at least 4 tasks per CPU - like even as high as 1000 partitions?"

Aug 20, 2018 · 报错如下: : org.apache.spark.SparkException: Job aborted due to stage failure: Task 0 in stage 3.0 failed 4 times, most recent failure: ...

Dec 29, 2020 · When I run the demo : from pyspark.ml.linalg import Vectors import tempfile conf = SparkConf().setAppName('ansonzhou_test').setAll([ ('spark.executor.memory', '8g ... For Spark jobs submitted with --deploy-mode cluster, run the following command on the master node to find stage failures in the YARN application logs. Replace application_id with the ID of your Spark application (for example, application_1572839353552_0008 ). yarn logs -applicationId application_id | grep "Job aborted due to stage failure" -A 10. 1 Answer. PySpark DF are lazy loading. When you call .show () you are asking the prior steps to execute and anyone of them may not work, you just can't see it until you call .show () because they haven't executed. I go back to earlier steps and call .collect () on each operation of the DF. This will at least allow you to isolate where the bad ...Job aborted due to stage failure: ShuffleMapStage 20 (repartition at data_prep.scala:87) has failed the maximum allowable number of times: 4 2 Why does Spark fail with FetchFailed error?Jul 17, 2020 · Caused by: org.apache.spark.SparkException: Job aborted due to stage failure: Serialized task 2:0 was 155731289 bytes, which exceeds max allowed: spark.rpc.message.maxSize (134217728 bytes). Consider increasing spark.rpc.message.maxSize or using broadcast variables for large values. Here are some ideas to fix this error: Serializable the class. Declare the instance only within the lambda function passed in map. Make the NotSerializable object as a static and create it once per machine. Call rdd.forEachPartition and create the NotSerializable object in there like this: rdd.forEachPartition (iter -> { NotSerializable ...Oct 31, 2022 · I am trying to run a pyspark job but it is failing on RDD collectAndServe method. I do not have any memory issues. I have all updated jars in my jars folder. Python worker is crashing with below er... But failed with 10GB file. My dataproc has 1 master with 4CPU, 26GB memory, 500GB disk. 5 workers with same config. I guess it should've been able to handle 10GB data. My command is toDatabase.repartition (10).write.json ("gs://mypath") Error is. org.apache.spark.SparkException: Job aborted. at org.apache.spark.sql.execution.datasources ...Jun 1, 2022 · Collectives™ on Stack Overflow – Centralized & trusted content around the technologies you use the most. If absolutely necessary you can set the property spark.driver.maxResultSize to a value <X>g higher than the value reported in the exception message in the cluster Spark config ( AWS | Azure ): spark.driver.maxResultSize < X > g. The default value is 4g. For details, see Application Properties. If you set a high limit, out-of-memory errors can ...Currently I'm doing PySpark and working on DataFrame. I've created a DataFrame: from pyspark.sql import * import pandas as pd spark = SparkSession.builder.appName(&quot;DataFarme&quot;).getOrCreate...

You may not have right permissions. I have the same problem when I use a docker image jupyter/pyspark-notebook to run an example code of pyspark, and it was solved by using root within the container.May 11, 2022 · If absolutely necessary you can set the property spark.driver.maxResultSize to a value <X>g higher than the value reported in the exception message in the cluster Spark config ( AWS | Azure ): spark.driver.maxResultSize < X > g. The default value is 4g. For details, see Application Properties. If you set a high limit, out-of-memory errors can ... 1 Answer. Sorted by: 1. You need to create an RDD of type RDD [Tuple [str]] but in your code, the line: rdd = spark.sparkContext.parallelize (comments) returns RDD [str] which then fails when you try to convert it to dataframe with that given schema. Try modifying that line to:Instagram:https://instagram. referenzenscag stc48a 19ka partsfloatverlegeprofile Mar 29, 2020 · Check Apache Spark installation on Windows 10 steps. Use different versions of Apache Spark (tried 2.4.3 / 2.4.2 / 2.3.4). Disable firewall windows and antivirus that I have installed. Tried to initialize the SparkContext manually with sc = spark.sparkContext (found this possible solution at this question here in Stackoverflow, didn´t work for ... muslim men1670203048 Teams. Q&A for work. Connect and share knowledge within a single location that is structured and easy to search. Learn more about Teams vampire diaries convention dallas 2023 tickets May 8, 2021 · org.apache.spark.SparkException: Job aborted due to stage failure: Task 3 in stage 6.0 failed 1 times, most recent failure: Lost task 3.0 in stage 6.0 (TID 62, LAPTOP-H7MM9952, executor driver): org.apache.spark.SparkException: Task failed while writing rows. I'm new to spark, and was trying to run the example JavaSparkPi.java, it runs well, but because i have to use this in another java s I copy all things from main to a method in the class and try to call the method in main, it saids . org.apache.spark.SparkException: Job aborted: Task not serializable: java.io.NotSerializableExceptionJul 7, 2019 · 1 I'm trying to use Linear Regression on a simple dataframe with one feature and one label using Python pyspark in Databricks. However, I'm running into some issues with stage failure. I've reviewed many similar problems, but most of them are in Scala or are out of the scope of what I'm doing here. Versions: